{"text_format":"1","workbook":"xlsx","n_sheets":12,"sheets":["1 - Standards","2 - HSS","3 - CR","4 - PR","5 - FR","6 - TS","7 - SHR","8 - HIM","GQM Template","Legend","Dashboard","Analysis"],"not_rendered":{"charts":0,"images":0,"macros":1,"external_links":1,"defined_names":5,"comments":0,"pivot_tables":0},"unopened":[],"bounds":{"document_bytes":16777216,"sheet_cells":100000,"rows_first":2000,"rows_last":500,"rows_between":2000,"halvings":0,"cell_chars":16384,"cell_head_chars":4096},"cells_cut":0,"cells_raw":0,"read":"whole","date_system":"1900"}

{"sheet":"1 - Standards","index":0,"n_rows":19,"n_cols":16,"rows_kept":19,"cut":false,"hidden":false,"merged":[]}
["GQM",null,null,"#","Content","Avg Risk","Max Risk","Date","POV",null,null,null,null,null,{"$f":"Legend!$B$14","v":5},{"$f":"Legend!$B$13","v":12}]
["G",null,null,1,"Evaluate standards with respect to adoption from the point of view of executive leadership. ",{"$f":"J18","v":{"$error":"#N/A"}},{"$f":"J19","v":{"$error":"#N/A"}}]
[null,null,null,null,"Rationale: Improved health relies on continuity of care, continuity of care relies on interoperability, interoperability relies on standards. Risks regarding our ability to embrace standards are risks to our ability to broadly support continuity of care at scale."]
[null,"Date","POV",null,null,"Best Case","Worst Case","Scale","Impact","Risk","Notes"]
["Q",{"$f":"$H$2","v":"00:00:00"},{"$f":"$I$2","v":0},{"$f":"NextWBS(2,$D$2,1)","v":"1.1"},"How aware is the team of avialable and applicable ehealth standards?",null,null,null,null,{"$f":"IF(A5=\"M\",HLOOKUP(H5,Legend!$C$3:$H$4,2,FALSE)*VLOOKUP(I5,Legend!$A$5:$B$10,2,FALSE),0)","v":0}]
["M",{"$f":"$H$2","v":"00:00:00"},{"$f":"$I$2","v":0},{"$f":"NextWBS(IF(A6=\"M\",3,2),D5,1)","v":"1.1.1"},"Do members of the team subscribe to international informatics journals?","Engaged Active Researcher","Never Read Informatics Journals",null,null,{"$f":"IF(A6=\"M\",HLOOKUP(H6,Legend!$C$3:$H$4,2,FALSE)*VLOOKUP(I6,Legend!$A$5:$B$10,2,FALSE),0)","v":{"$error":"#N/A"}}]
{"$rows_left_out":14}
{"sheet":"2 - HSS","index":1,"n_rows":29,"n_cols":16,"rows_kept":29,"cut":false,"hidden":false,"merged":[]}
["GQM",null,null,"#","Content","Avg Risk","Max Risk","Date","POV",null,null,null,null,null,{"$f":"Legend!$B$14","v":5},{"$f":"Legend!$B$13","v":12}]
["G",null,null,2,"Evaluate the OpenHIE eHealth infrastructure with respect to its ability to support key health system strengthening (HSS) practices from the point of view of a national ministry of health.",{"$f":"J28","v":{"$error":"#N/A"}},{"$f":"J29","v":{"$error":"#N/A"}}]
[null,null,null,null,"Rationale: The role of the eHealth infrastructure is to support the improvement of population health."]
[null,"Date","POV",null,null,"Best Case","Worst Case","Scale","Impact","Risk","Notes"]
["Q",{"$f":"$H$2","v":"00:00:00"},{"$f":"$I$2","v":0},{"$f":"NextWBS(2,$D$2,1)","v":"2.1"},"Is there a way to operationalize care guidelines within the OpenHIE infrastructure",null,null,null,null,{"$f":"IF(A5=\"M\",HLOOKUP(H5,Legend!$C$3:$H$4,2,FALSE)*VLOOKUP(I5,Legend!$A$5:$B$10,2,FALSE),0)","v":0}]
["M",{"$f":"$H$2","v":"00:00:00"},{"$f":"$I$2","v":0},{"$f":"NextWBS(IF(A6=\"M\",3,2),D5,1)","v":"2.1.1"},"Are care guidelines available in a \"computable\" format for the care initiatives important to the MOH (e.g. maternal care, HIV & TB, etc.)?","guidelines available in a standard workflow format","guidelines in non-standard text format",null,null,{"$f":"IF(A6=\"M\",HLOOKUP(H6,Legend!$C$3:$H$4,2,FALSE)*VLOOKUP(I6,Legend!$A$5:$B$10,2,FALSE),0)","v":{"$error":"#N/A"}}]
{"$rows_left_out":24}
{"sheet":"3 - CR","index":2,"n_rows":31,"n_cols":16,"rows_kept":31,"cut":false,"hidden":false,"merged":[]}
["GQM",null,null,"#","Content","Avg Risk","Max Risk","Date","POV",null,null,null,null,null,{"$f":"Legend!$B$14","v":5},{"$f":"Legend!$B$13","v":12}]
["G",null,null,3,"Evaluate the Client Registry (CR) with respect to its ability to meet functional and non functional requirements from the point of view of the overal OpenHIE infrastructure ",{"$f":"J30","v":{"$error":"#N/A"}},{"$f":"J31","v":{"$error":"#N/A"}}]
[null,null,null,null,"Rationale: We are only as strong as your weekest link; each transaction is co-owned by all the components of our OpenHIE infrastructure."]
[null,"Date","POV",null,null,"Best Case","Worst Case","Scale","Impact","Risk","Notes"]
["Q",{"$f":"$H$2","v":"00:00:00"},{"$f":"$I$2","v":0},{"$f":"NextWBS(2,$D$2,1)","v":"3.1"},"Are the CR functional requirements accurate, complete and well understood?",null,null,null,null,{"$f":"IF(A5=\"M\",HLOOKUP(H5,Legend!$C$3:$H$4,2,FALSE)*VLOOKUP(I5,Legend!$A$5:$B$10,2,FALSE),0)","v":0}]
["M",{"$f":"$H$2","v":"00:00:00"},{"$f":"$I$2","v":0},{"$f":"NextWBS(IF(A6=\"M\",3,2),D5,1)","v":"3.1.1"},"Are the CR use cases well documented?","well documented using a standard format","no documentation",null,null,{"$f":"IF(A6=\"M\",HLOOKUP(H6,Legend!$C$3:$H$4,2,FALSE)*VLOOKUP(I6,Legend!$A$5:$B$10,2,FALSE),0)","v":{"$error":"#N/A"}}]
{"$rows_left_out":26}
{"sheet":"4 - PR","index":3,"n_rows":31,"n_cols":16,"rows_kept":31,"cut":false,"hidden":false,"merged":[]}
["GQM",null,null,"#","Content","Avg Risk","Max Risk","Date","POV",null,null,null,null,null,{"$f":"Legend!$B$14","v":5},{"$f":"Legend!$B$13","v":12}]
["G",null,null,4,"Evaluate the Provider Registry (PR) with respect to its ability to meet functional and non functional requirements from the point of view of the overal OpenHIE infrastructure ",{"$f":"J30","v":{"$error":"#N/A"}},{"$f":"J31","v":{"$error":"#N/A"}}]
[null,null,null,null,"Rationale: We are only as strong as your weekest link; each transaction is co-owned by all the components of our OpenHIE infrastructure."]
[null,"Date","POV",null,null,"Best Case","Worst Case","Scale","Impact","Risk","Notes"]
["Q",{"$f":"$H$2","v":"00:00:00"},{"$f":"$I$2","v":0},{"$f":"NextWBS(2,$D$2,1)","v":"4.1"},"Are the PR functional requirements accurate, complete and well understood?",null,null,null,null,{"$f":"IF(A5=\"M\",HLOOKUP(H5,Legend!$C$3:$H$4,2,FALSE)*VLOOKUP(I5,Legend!$A$5:$B$10,2,FALSE),0)","v":0}]
["M",{"$f":"$H$2","v":"00:00:00"},{"$f":"$I$2","v":0},{"$f":"NextWBS(IF(A6=\"M\",3,2),D5,1)","v":"4.1.1"},"Are the PR use cases well documented?","well documented using a standard format","no documentation",null,null,{"$f":"IF(A6=\"M\",HLOOKUP(H6,Legend!$C$3:$H$4,2,FALSE)*VLOOKUP(I6,Legend!$A$5:$B$10,2,FALSE),0)","v":{"$error":"#N/A"}}]
{"$rows_left_out":26}
{"sheet":"5 - FR","index":4,"n_rows":31,"n_cols":16,"rows_kept":31,"cut":false,"hidden":false,"merged":[]}
["GQM",null,null,"#","Content","Avg Risk","Max Risk","Date","POV",null,null,null,null,null,{"$f":"Legend!$B$14","v":5},{"$f":"Legend!$B$13","v":12}]
["G",null,null,5,"Evaluate the Facility Registry (FR) with respect to its ability to meet functional and non functional requirements from the point of view of the overal OpenHIE infrastructure ",{"$f":"J30","v":{"$error":"#N/A"}},{"$f":"J31","v":{"$error":"#N/A"}}]
[null,null,null,null,"Rationale: We are only as strong as your weekest link; each transaction is co-owned by all the components of our OpenHIE infrastructure."]
[null,"Date","POV",null,null,"Best Case","Worst Case","Scale","Impact","Risk","Notes"]
["Q",{"$f":"$H$2","v":"00:00:00"},{"$f":"$I$2","v":0},{"$f":"NextWBS(2,$D$2,1)","v":"5.1"},"Are the FR functional requirements accurate, complete and well understood?",null,null,null,null,{"$f":"IF(A5=\"M\",HLOOKUP(H5,Legend!$C$3:$H$4,2,FALSE)*VLOOKUP(I5,Legend!$A$5:$B$10,2,FALSE),0)","v":0}]
["M",{"$f":"$H$2","v":"00:00:00"},{"$f":"$I$2","v":0},{"$f":"NextWBS(IF(A6=\"M\",3,2),D5,1)","v":"5.1.1"},"Are the FR use cases well documented?","well documented using a standard format","no documentation",null,null,{"$f":"IF(A6=\"M\",HLOOKUP(H6,Legend!$C$3:$H$4,2,FALSE)*VLOOKUP(I6,Legend!$A$5:$B$10,2,FALSE),0)","v":{"$error":"#N/A"}}]
{"$rows_left_out":26}
{"sheet":"6 - TS","index":5,"n_rows":31,"n_cols":16,"rows_kept":31,"cut":false,"hidden":false,"merged":[]}
["GQM",null,null,"#","Content","Avg Risk","Max Risk","Date","POV",null,null,null,null,null,{"$f":"Legend!$B$14","v":5},{"$f":"Legend!$B$13","v":12}]
["G",null,null,6,"Evaluate the Terminology Service (TS) with respect to its ability to meet functional and non functional requirements from the point of view of the overal OpenHIE infrastructure ",{"$f":"J30","v":{"$error":"#N/A"}},{"$f":"J31","v":{"$error":"#N/A"}}]
[null,null,null,null,"Rationale: We are only as strong as your weekest link; each transaction is co-owned by all the components of our OpenHIE infrastructure."]
[null,"Date","POV",null,null,"Best Case","Worst Case","Scale","Impact","Risk","Notes"]
["Q",{"$f":"$H$2","v":"00:00:00"},{"$f":"$I$2","v":0},{"$f":"NextWBS(2,$D$2,1)","v":"6.1"},"Are the TS functional requirements accurate, complete and well understood?",null,null,null,null,{"$f":"IF(A5=\"M\",HLOOKUP(H5,Legend!$C$3:$H$4,2,FALSE)*VLOOKUP(I5,Legend!$A$5:$B$10,2,FALSE),0)","v":0}]
["M",{"$f":"$H$2","v":"00:00:00"},{"$f":"$I$2","v":0},{"$f":"NextWBS(IF(A6=\"M\",3,2),D5,1)","v":"6.1.1"},"Are the TS use cases well documented?","well documented using a standard format","no documentation",null,null,{"$f":"IF(A6=\"M\",HLOOKUP(H6,Legend!$C$3:$H$4,2,FALSE)*VLOOKUP(I6,Legend!$A$5:$B$10,2,FALSE),0)","v":{"$error":"#N/A"}}]
{"$rows_left_out":26}
{"sheet":"7 - SHR","index":6,"n_rows":31,"n_cols":16,"rows_kept":31,"cut":false,"hidden":false,"merged":[]}
["GQM",null,null,"#","Content","Avg Risk","Max Risk","Date","POV",null,null,null,null,null,{"$f":"Legend!$B$14","v":5},{"$f":"Legend!$B$13","v":12}]
["G",null,null,7,"Evaluate the Shared Health Record repository (SHR) with respect to its ability to meet functional and non functional requirements from the point of view of the overal OpenHIE infrastructure ",{"$f":"J30","v":{"$error":"#N/A"}},{"$f":"J31","v":{"$error":"#N/A"}}]
[null,null,null,null,"Rationale: We are only as strong as your weekest link; each transaction is co-owned by all the components of our OpenHIE infrastructure."]
[null,"Date","POV",null,null,"Best Case","Worst Case","Scale","Impact","Risk","Notes"]
["Q",{"$f":"$H$2","v":"00:00:00"},{"$f":"$I$2","v":0},{"$f":"NextWBS(2,$D$2,1)","v":"7.1"},"Are the SHR functional requirements accurate, complete and well understood?",null,null,null,null,{"$f":"IF(A5=\"M\",HLOOKUP(H5,Legend!$C$3:$H$4,2,FALSE)*VLOOKUP(I5,Legend!$A$5:$B$10,2,FALSE),0)","v":0}]
["M",{"$f":"$H$2","v":"00:00:00"},{"$f":"$I$2","v":0},{"$f":"NextWBS(IF(A6=\"M\",3,2),D5,1)","v":"7.1.1"},"Are the SHR use cases well documented?","well documented using a standard format","no documentation",null,null,{"$f":"IF(A6=\"M\",HLOOKUP(H6,Legend!$C$3:$H$4,2,FALSE)*VLOOKUP(I6,Legend!$A$5:$B$10,2,FALSE),0)","v":{"$error":"#N/A"}}]
{"$rows_left_out":26}
{"sheet":"8 - HIM","index":7,"n_rows":31,"n_cols":16,"rows_kept":31,"cut":false,"hidden":false,"merged":[]}
["GQM",null,null,"#","Content","Avg Risk","Max Risk","Date","POV",null,null,null,null,null,{"$f":"Legend!$B$14","v":5},{"$f":"Legend!$B$13","v":12}]
["G",null,null,8,"Evaluate the Health Information Mediator (HIM) with respect to its ability to meet functional and non functional requirements from the point of view of the overal OpenHIE infrastructure ",{"$f":"J30","v":{"$error":"#N/A"}},{"$f":"J31","v":{"$error":"#N/A"}}]
[null,null,null,null,"Rationale: We are only as strong as your weekest link; each transaction is co-owned by all the components of our OpenHIE infrastructure."]
[null,"Date","POV",null,null,"Best Case","Worst Case","Scale","Impact","Risk","Notes"]
["Q",{"$f":"$H$2","v":"00:00:00"},{"$f":"$I$2","v":0},{"$f":"NextWBS(2,$D$2,1)","v":"8.1"},"Are the HIM functional requirements accurate, complete and well understood?",null,null,null,null,{"$f":"IF(A5=\"M\",HLOOKUP(H5,Legend!$C$3:$H$4,2,FALSE)*VLOOKUP(I5,Legend!$A$5:$B$10,2,FALSE),0)","v":0}]
["M",{"$f":"$H$2","v":"00:00:00"},{"$f":"$I$2","v":0},{"$f":"NextWBS(IF(A6=\"M\",3,2),D5,1)","v":"8.1.1"},"Are the HIM use cases well documented?","well documented using a standard format","no documentation",null,null,{"$f":"IF(A6=\"M\",HLOOKUP(H6,Legend!$C$3:$H$4,2,FALSE)*VLOOKUP(I6,Legend!$A$5:$B$10,2,FALSE),0)","v":{"$error":"#N/A"}}]
{"$rows_left_out":26}
{"sheet":"GQM Template","index":8,"n_rows":39,"n_cols":16,"rows_kept":39,"cut":false,"hidden":true,"merged":[]}
["GQM",null,null,"#","Content","Avg Risk","Max Risk","Date","POV",null,null,null,null,null,{"$f":"Legend!$B$14","v":5},{"$f":"Legend!$B$13","v":12}]
["G",null,null,1,"Evaluate <describe evaluation target> with respect to <describe evaluation criteria> from the point of view of <specify stakeholder>. ",{"$f":"J38","v":{"$error":"#N/A"}},{"$f":"J39","v":{"$error":"#N/A"}}]
[null,null,null,null,"Rationale"]
[null,"Date","POV",null,null,"Best Case","Worst Case","Scale","Impact","Risk","Notes"]
["Q",{"$f":"$H$2","v":"00:00:00"},{"$f":"$I$2","v":0},{"$f":"NextWBS(2,$D$2,1)","v":"1.1"},"Question",null,null,null,null,{"$f":"IF(A5=\"M\",HLOOKUP(H5,Legend!$C$3:$H$4,2,FALSE)*VLOOKUP(I5,Legend!$A$5:$B$10,2,FALSE),0)","v":0}]
["M",{"$f":"$H$2","v":"00:00:00"},{"$f":"$I$2","v":0},{"$f":"NextWBS(IF(A6=\"M\",3,2),D5,1)","v":"1.1.1"},"Metric","describe best case","describe worst case",null,null,{"$f":"IF(A6=\"M\",HLOOKUP(H6,Legend!$C$3:$H$4,2,FALSE)*VLOOKUP(I6,Legend!$A$5:$B$10,2,FALSE),0)","v":{"$error":"#N/A"}}]
{"$rows_left_out":34}
{"sheet":"Legend","index":9,"n_rows":26,"n_cols":8,"rows_kept":26,"cut":false,"hidden":true,"merged":[]}
[]
[null,null,"Likelihood"]
[null,null,"Best Case","Good","Medium","Poor","Worst Case","Unknown"]
["Impact",null,1,2,3,4,5,5]
["Catastrophic",5,{"$f":"$C$4*B5","v":5},{"$f":"$D$4*B5","v":10},{"$f":"$E$4*B5","v":15},{"$f":"$F$4*B5","v":20},{"$f":"$G$4*B5","v":25},{"$f":"$H$4*B5","v":25}]
["Major",4,4,8,12,16,20,20]
{"$rows_left_out":21}
{"sheet":"Dashboard","index":10,"n_rows":9,"n_cols":16,"rows_kept":9,"cut":false,"hidden":true,"merged":[]}
["GQM",null,null,"#","Content","Avg Risk","Max Risk","Date","POV",null,null,null,null,null,{"$f":"Legend!$B$14","v":5},{"$f":"Legend!$B$13","v":12}]
[{"$f":"'1 - Standards'!A2","v":"G"},{"$f":"'1 - Standards'!B2","v":0},{"$f":"'1 - Standards'!C2","v":0},{"$f":"'1 - Standards'!D2","v":1},{"$f":"'1 - Standards'!E2","v":"Evaluate standards with respect to adoption from the point of view of executive leadership. "},{"$f":"'1 - Standards'!F2","v":{"$error":"#N/A"}},{"$f":"'1 - Standards'!G2","v":{"$error":"#N/A"}},{"$f":"'1 - Standards'!H2","v":"00:00:00"},{"$f":"'1 - Standards'!I2","v":0}]
[{"$f":"'2 - HSS'!A2","v":"G"},{"$f":"'2 - HSS'!B2","v":0},{"$f":"'2 - HSS'!C2","v":0},{"$f":"'2 - HSS'!D2","v":2},{"$f":"'2 - HSS'!E2","v":"Evaluate the OpenHIE eHealth infrastructure with respect to its ability to support key health system strengthening (HSS) practices from the point of view of a national ministry of health."},{"$f":"'2 - HSS'!F2","v":{"$error":"#N/A"}},{"$f":"'2 - HSS'!G2","v":{"$error":"#N/A"}},{"$f":"'2 - HSS'!H2","v":"00:00:00"},{"$f":"'2 - HSS'!I2","v":0}]
[{"$f":"'3 - CR'!A2","v":"G"},{"$f":"'3 - CR'!B2","v":0},{"$f":"'3 - CR'!C2","v":0},{"$f":"'3 - CR'!D2","v":3},{"$f":"'3 - CR'!E2","v":"Evaluate the Client Registry (CR) with respect to its ability to meet functional and non functional requirements from the point of view of the overal OpenHIE infrastructure "},{"$f":"'3 - CR'!F2","v":{"$error":"#N/A"}},{"$f":"'3 - CR'!G2","v":{"$error":"#N/A"}},{"$f":"'3 - CR'!H2","v":"00:00:00"},{"$f":"'3 - CR'!I2","v":0}]
[{"$f":"'4 - PR'!A2","v":"G"},{"$f":"'4 - PR'!B2","v":0},{"$f":"'4 - PR'!C2","v":0},{"$f":"'4 - PR'!D2","v":4},{"$f":"'4 - PR'!E2","v":"Evaluate the Provider Registry (PR) with respect to its ability to meet functional and non functional requirements from the point of view of the overal OpenHIE infrastructure "},{"$f":"'4 - PR'!F2","v":{"$error":"#N/A"}},{"$f":"'4 - PR'!G2","v":{"$error":"#N/A"}},{"$f":"'4 - PR'!H2","v":"00:00:00"},{"$f":"'4 - PR'!I2","v":0}]
[{"$f":"'5 - FR'!A2","v":"G"},{"$f":"'5 - FR'!B2","v":0},{"$f":"'5 - FR'!C2","v":0},{"$f":"'5 - FR'!D2","v":5},{"$f":"'5 - FR'!E2","v":"Evaluate the Facility Registry (FR) with respect to its ability to meet functional and non functional requirements from the point of view of the overal OpenHIE infrastructure "},{"$f":"'5 - FR'!F2","v":{"$error":"#N/A"}},{"$f":"'5 - FR'!G2","v":{"$error":"#N/A"}},{"$f":"'5 - FR'!H2","v":"00:00:00"},{"$f":"'5 - FR'!I2","v":0}]
{"$rows_left_out":4}
{"sheet":"Analysis","index":11,"n_rows":140,"n_cols":16,"rows_kept":140,"cut":false,"hidden":true,"merged":[]}
["GQM","Date","POV","#","Content","Best Case","Worst Case","Scale","Impact","Risk","Notes",null,null,null,{"$f":"Legend!$B$14","v":5},{"$f":"Legend!$B$13","v":12}]
[{"$f":"'1 - Standards'!A6","v":"M"},{"$f":"'1 - Standards'!B6","v":"00:00:00"},{"$f":"'1 - Standards'!C6","v":0},{"$f":"'1 - Standards'!D6","v":"1.1.1"},{"$f":"'1 - Standards'!E6","v":"Do members of the team subscribe to international informatics journals?"},{"$f":"'1 - Standards'!F6","v":"Engaged Active Researcher"},{"$f":"'1 - Standards'!G6","v":"Never Read Informatics Journals"},{"$f":"'1 - Standards'!H6","v":0},{"$f":"'1 - Standards'!I6","v":0},{"$f":"'1 - Standards'!J6","v":{"$error":"#N/A"}},{"$f":"'1 - Standards'!K6","v":0}]
[{"$f":"'1 - Standards'!A7","v":"M"},{"$f":"'1 - Standards'!B7","v":"00:00:00"},{"$f":"'1 - Standards'!C7","v":0},{"$f":"'1 - Standards'!D7","v":"1.1.2"},{"$f":"'1 - Standards'!E7","v":"Do members of the team understand applicable standards and integrate them into the OpenHIE?"},{"$f":"'1 - Standards'!F7","v":"Always use existing standards where applicable"},{"$f":"'1 - Standards'!G7","v":"Never Use Standards"},{"$f":"'1 - Standards'!H7","v":0},{"$f":"'1 - Standards'!I7","v":0},{"$f":"'1 - Standards'!J7","v":{"$error":"#N/A"}},{"$f":"'1 - Standards'!K7","v":0}]
[{"$f":"'1 - Standards'!A8","v":"M"},{"$f":"'1 - Standards'!B8","v":"00:00:00"},{"$f":"'1 - Standards'!C8","v":0},{"$f":"'1 - Standards'!D8","v":"1.1.3"},{"$f":"'1 - Standards'!E8","v":"Do members of the team participate in standards conformance testing events?"},{"$f":"'1 - Standards'!F8","v":"Fully engaged Participation"},{"$f":"'1 - Standards'!G8","v":"No Participation"},{"$f":"'1 - Standards'!H8","v":0},{"$f":"'1 - Standards'!I8","v":0},{"$f":"'1 - Standards'!J8","v":{"$error":"#N/A"}},{"$f":"'1 - Standards'!K8","v":0}]
[{"$f":"'1 - Standards'!A10","v":"M"},{"$f":"'1 - Standards'!B10","v":"00:00:00"},{"$f":"'1 - Standards'!C10","v":0},{"$f":"'1 - Standards'!D10","v":"1.2.1"},{"$f":"'1 - Standards'!E10","v":"Are team members active participants of standards development organizations? (eg:HL7, IHTSDO,IHE)"},{"$f":"'1 - Standards'!F10","v":"Active Participation"},{"$f":"'1 - Standards'!G10","v":"No Participation"},{"$f":"'1 - Standards'!H10","v":0},{"$f":"'1 - Standards'!I10","v":0},{"$f":"'1 - Standards'!J10","v":{"$error":"#N/A"}},{"$f":"'1 - Standards'!K10","v":0}]
[{"$f":"'1 - Standards'!A11","v":"M"},{"$f":"'1 - Standards'!B11","v":"00:00:00"},{"$f":"'1 - Standards'!C11","v":0},{"$f":"'1 - Standards'!D11","v":"1.2.2"},{"$f":"'1 - Standards'!E11","v":"Is there an internal governance process in OpenHIE to determine when & how new specifications be brought forward to SDOs?"},{"$f":"'1 - Standards'!F11","v":"Well defined process, always used"},{"$f":"'1 - Standards'!G11","v":"No Process"},{"$f":"'1 - Standards'!H11","v":0},{"$f":"'1 - Standards'!I11","v":0},{"$f":"'1 - Standards'!J11","v":{"$error":"#N/A"}},{"$f":"'1 - Standards'!K11","v":0}]
{"$rows_left_out":134}